FinalBuilder 6 LogFile for DCM_Build.fbz7

Project File : C:\Users\build\AppData\Local\Temp\FBT81AE.fbl7
Log Title : DCM_Build.fbz7
Date : 01/02/2019
Start Time : 19:38:36
End Time : 21:08:26
Run Time : 01:29:50

Status Action Name Description Start Time End Time Run Time Output
Show All
Hide All
Error Execute Program Build Unit Test Projects 20:57:20 20:57:21 00:00:00 View
Executing external process: C:\Program Files (x86)\MSBuild\14.0\Bin\MSBuild.exe Starting Directory: s: Parameters: "vianova\Novapoint\Core\UI\RenderPlugin\Tests\RenderPlugin.Tests.vcxproj" /t:Build /p:Configuration=Release /p:TargetFrameworkVersion=v4.6.1 /p:PlatformToolset=v140 /p:Platform=x64 Output from C:\Program Files (x86)\MSBuild\14.0\Bin\MSBuild.exe Microsoft (R) Build Engine version 14.0.25123.0 Copyright (C) Microsoft Corporation. All rights reserved. Build started 01.02.2019 20:57:20. Project "S:\vianova\Novapoint\Core\UI\RenderPlugin\Tests\RenderPlugin.Tests.vcxproj" on node 1 (Build target(s)). C:\Program Files (x86)\MSBuild\Microsoft.Cpp\v4.0\V140\Platforms\x64\PlatformToolsets\v140\Toolset.targets(36,5): error MSB8036: The Windows SDK version 10.0.17763.0 was not found. Install the required version of Windows SDK or change the SDK version in the project property pages or by right-clicking the solution and selecting "Retarget solution". [S:\vianova\Novapoint\Core\UI\RenderPlugin\Tests\RenderPlugin.Tests.vcxproj] Done Building Project "S:\vianova\Novapoint\Core\UI\RenderPlugin\Tests\RenderPlugin.Tests.vcxproj" (Build target(s)) -- FAILED. Build FAILED. "S:\vianova\Novapoint\Core\UI\RenderPlugin\Tests\RenderPlugin.Tests.vcxproj" (Build target) (1) -> (Desktop_PlatformPrepareForBuild target) -> C:\Program Files (x86)\MSBuild\Microsoft.Cpp\v4.0\V140\Platforms\x64\PlatformToolsets\v140\Toolset.targets(36,5): error MSB8036: The Windows SDK version 10.0.17763.0 was not found. Install the required version of Windows SDK or change the SDK version in the project property pages or by right-clicking the solution and selecting "Retarget solution". [S:\vianova\Novapoint\Core\UI\RenderPlugin\Tests\RenderPlugin.Tests.vcxproj] 0 Warning(s) 1 Error(s) Time Elapsed 00:00:00.23 Program returned code : 1