FinalBuilder 6 LogFile for DCM_Build.fbz7

Project File : C:\Users\build\AppData\Local\Temp\FBT152C.fbl7
Log Title : DCM_Build.fbz7
Date : 14/02/2019
Start Time : 08:13:04
End Time : 08:41:14
Run Time : 00:28:09

Status Action Name Description Start Time End Time Run Time Output
Show All
Hide All
Error Execute Program MSBuild vianova\Application\OpenTNF\OpenTNF.vcxproj (/Build) 08:30:31 08:30:48 00:00:17 View
Executing external process: C:\Program Files (x86)\MSBuild\14.0\Bin\MSBuild.exe Starting Directory: S: Parameters: "vianova\Application\OpenTNF\OpenTNF.vcxproj" /t:Build /p:Configuration=Release /p:TargetFrameworkVersion=v4.6.1 /p:PlatformToolset=v140 /p:Platform=x64 Output from C:\Program Files (x86)\MSBuild\14.0\Bin\MSBuild.exe Microsoft (R) Build Engine version 14.0.25123.0 Copyright (C) Microsoft Corporation. All rights reserved. Build started 14.02.2019 08:30:31. Project "S:\vianova\Application\OpenTNF\OpenTNF.vcxproj" on node 1 (Build target(s)). InitializeBuildStatus: Creating "U:\\OpenTNF\Release\OpenTNF.tlog\unsuccessfulbuild" because "AlwaysCreate" was specified. PreBuildEvent: copy app.config "T:\Novapoint\OpenTNF.exe.config" :VCEnd 1 file(s) copied. GenerateTargetFrameworkMonikerAttribute: Skipping target "GenerateTargetFrameworkMonikerAttribute" because all output files are up-to-date with respect to the input files. ClCompile: All outputs are up-to-date. C:\Program Files (x86)\Microsoft Visual Studio 14.0\VC\bin\x86_amd64\CL.exe /c /IT:\Inc\Third_Party_Products\nvdb\inc /AI"C:\Program Files (x86)\Reference Assemblies\Microsoft\Framework\.NETFramework\v4.6.1\\" /AI"C:\Program Files (x86)\Windows Kits\8.1\References\CommonConfiguration\Neutral" /AI"C:\Program Files (x86)\Reference Assemblies\Microsoft\Framework\.NETFramework\v4.6.1\Facades\\" /Zi /clr /nologo /W3 /WX- /MP /O2 /Ob2 /Ot /D WIN32 /D NDEBUG /D ENABLE_LANDCODE /D _UNICODE /D UNICODE /EHa /MD /GS /fp:precise /Zc:wchar_t /Zc:forScope /Zc:inline /Yu"stdafx.h" /Fp"U:\\OpenTNF\Release\OpenTNF.pch" /Fo"U:\\OpenTNF\Release\\" /Fd"U:\\OpenTNF\Release\vc140.pdb" /TP /FUT:\Novapoint\\3rdParty\Quadri\log4net.dll /FU"C:\Program Files (x86)\Reference Assemblies\Microsoft\Framework\.NETFramework\v4.6.1\mscorlib.dll" /FUT:\Novapoint\\Binaries\Novapoint.Core.QuadriModel.dll /FUT:\Novapoint\\3rdParty\GeoPackage\OpenTNF.Library.dll /FU"C:\Program Files (x86)\Reference Assemblies\Microsoft\Framework\.NETFramework\v4.6.1\System.Configuration.dll" /FU"C:\Program Files (x86)\Reference Assemblies\Microsoft\Framework\.NETFramework\v4.6.1\System.Core.dll" /FU"C:\Program Files (x86)\Reference Assemblies\Microsoft\Framework\.NETFramework\v4.6.1\System.Data.dll" /FUT:\Novapoint\\3rdParty\GeoPackage\System.Data.SQLite.dll /FU"C:\Program Files (x86)\Reference Assemblies\Microsoft\Framework\.NETFramework\v4.6.1\System.dll" /FU"C:\Program Files (x86)\Reference Assemblies\Microsoft\Framework\.NETFramework\v4.6.1\System.Xml.dll" /FUT:\Novapoint\\3rdParty\GeoPackage\Triona.TNE.Common.dll /FUT:\Novapoint\\3rdParty\GeoPackage\Triona.TNE.Geometry.dll /FUT:\Novapoint\\3rdParty\GeoPackage\Triona.TNE.Geometry.GeoPackage.dll /FUT:\Novapoint\\Binaries\Vianova.Core.dll /FUT:\Novapoint\\Binaries\Vianova.Core.Exceptions.dll /FUT:\Novapoint\\Binaries\Vianova.Core.Math.dll /errorReport:queue /clr:nostdlib Config.cpp FeatureCatalog.cpp import\Importer.cpp Config.cpp FeatureCatalog.cpp Importer.cpp FeatureCatalog.cpp(1372): warning C4146: unary minus operator applied to unsigned type, result still unsigned [S:\vianova\Application\OpenTNF\OpenTNF.vcxproj] FeatureCatalog.cpp(1674): warning C4146: unary minus operator applied to unsigned type, result still unsigned [S:\vianova\Application\OpenTNF\OpenTNF.vcxproj] All outputs are up-to-date. ManagedIncrementalBuildPostProcessDependencyGraph: To improve incremental build performance for managed components, please make sure that the 'VC++ Directories->Reference Directories' points to all the paths which contain the referenced managed assemblies. Could not load file or assembly 'System.Core, Version=2.0.5.0, Culture=neutral, PublicKeyToken=7cec85d7bea7798e, Retargetable=Yes' or one of its dependencies. The system cannot find the file specified. To improve incremental build performance for managed components, please make sure that the 'VC++ Directories->Reference Directories' points to all the paths which contain the referenced managed assemblies. Could not load file or assembly 'System, Version=2.0.5.0, Culture=neutral, PublicKeyToken=7cec85d7bea7798e, Retargetable=Yes' or one of its dependencies. The system cannot find the file specified. To improve incremental build performance for managed components, please make sure that the 'VC++ Directories->Reference Directories' points to all the paths which contain the referenced managed assemblies. Could not load file or assembly 'Vianova.Core, Version=21.0.24054.0, Culture=neutral, PublicKeyToken=null' or one of its dependencies. The system cannot find the file specified. CoreResGen: "C:\Program Files (x86)\Microsoft SDKs\Windows\v10.0A\bin\NETFX 4.6 Tools\resgen.exe" /useSourcePath /r:T:\Novapoint\\3rdParty\Quadri\log4net.dll /r:"C:\Program Files (x86)\Reference Assemblies\Microsoft\Framework\.NETFramework\v4.6.1\mscorlib.dll" /r:T:\Novapoint\\Binaries\Novapoint.Core.QuadriModel.dll /r:T:\Novapoint\\3rdParty\GeoPackage\OpenTNF.Library.dll /r:"C:\Program Files (x86)\Reference Assemblies\Microsoft\Framework\.NETFramework\v4.6.1\System.Configuration.dll" /r:"C:\Program Files (x86)\Reference Assemblies\Microsoft\Framework\.NETFramework\v4.6.1\System.Core.dll" /r:"C:\Program Files (x86)\Reference Assemblies\Microsoft\Framework\.NETFramework\v4.6.1\System.Data.dll" /r:T:\Novapoint\\3rdParty\GeoPackage\System.Data.SQLite.dll /r:"C:\Program Files (x86)\Reference Assemblies\Microsoft\Framework\.NETFramework\v4.6.1\System.dll" /r:"C:\Program Files (x86)\Reference Assemblies\Microsoft\Framework\.NETFramework\v4.6.1\System.Xml.dll" /r:T:\Novapoint\\3rdParty\GeoPackage\Triona.TNE.Common.dll /r:T:\Novapoint\\3rdParty\GeoPackage\Triona.TNE.Geometry.dll /r:T:\Novapoint\\3rdParty\GeoPackage\Triona.TNE.Geometry.GeoPackage.dll /r:T:\Novapoint\\Binaries\Vianova.Core.dll /r:T:\Novapoint\\Binaries\Vianova.Core.Exceptions.dll /r:T:\Novapoint\\Binaries\Vianova.Core.Math.dll /compile Resources.resx,U:\\OpenTNF\Release\OpenTNF.Resources.resources Processing resource file "Resources.resx" into "U:\\OpenTNF\Release\OpenTNF.Resources.resources". ResourceCompile: All outputs are up-to-date. Link: C:\Program Files (x86)\Microsoft Visual Studio 14.0\VC\bin\x86_amd64\link.exe /ERRORREPORT:QUEUE /OUT:"T:\Novapoint\OpenTNF.exe" /NOLOGO /LIBPATH:T:\Lib\\Third_Party_Products\nvdb /LIBPATH:T:\Lib\\Third_Party_Products\nvdb Delayimp.lib /ASSEMBLYRESOURCE:U:\\OpenTNF\Release\OpenTNF.OpenTnfTypes.resources /ASSEMBLYRESOURCE:"U:\\OpenTNF\Release\OpenTNF.Resources.resources,OpenTNF.Resources.resources" /DELAYLOAD:NPROJECT.DLL /DELAYLOAD:NCOMMONPROPERTIES.DLL /DELAYLOAD:NQUADRICOMMONSETUP.DLL /DELAYLOAD:CALENDARTOOLS.DLL /DELAYLOAD:NmNVDBMod.dll /DELAYLOAD:NQuadriModelBuilder.dll /DELAYLOAD:Novapoint.Core.IO.Quadri.TypeRegistry.dll /DELAYLOAD:NFileStorage.dll /DELAYLOAD:Quadri.Math.dll /MANIFEST /MANIFESTUAC:"level='asInvoker' uiAccess='false'" /manifest:embed /PDB:"T:\Novapoint\OpenTNF.pdb" /OPT:REF /TLBID:1 /DYNAMICBASE /FIXED:NO /NXCOMPAT /MACHINE:X64 U:\\OpenTNF\Release\app.res U:\\OpenTNF\Release\AreaOfInterest.obj U:\\OpenTNF\Release\AssemblyInfo.obj U:\\OpenTNF\Release\AttributeProcessor.obj U:\\OpenTNF\Release\CommandLineParser.obj U:\\OpenTNF\Release\Config.obj U:\\OpenTNF\Release\Exporter.obj U:\\OpenTNF\Release\FeatureCatalog.obj U:\\OpenTNF\Release\Importer.obj U:\\OpenTNF\Release\TnfLinkSequenceManager.obj U:\\OpenTNF\Release\MockApplication.obj U:\\OpenTNF\Release\MockConfiguration.obj U:\\OpenTNF\Release\OpenTNF.obj U:\\OpenTNF\Release\stdafx.obj U:\\OpenTNF\Release\TaskInformation.obj U:\\OpenTNF\Release\TranslateFeatureCatalog.obj "U:\\OpenTNF\Release\.NETFramework,Version=v4.6.1.AssemblyAttributes.obj" FeatureCatalog.obj : error LNK2022: metadata operation failed (80131187) : Inconsistent method declarations in duplicated types (types: Importer; methods: import): (0x060000cb). [S:\vianova\Application\OpenTNF\OpenTNF.vcxproj] FeatureCatalog.obj : error LNK2022: metadata operation failed (80131188) : Inconsistent field declarations in duplicated types (types: Importer; fields: m_modelInfo): (0x04000440). [S:\vianova\Application\OpenTNF\OpenTNF.vcxproj] Importer.obj : error LNK2022: metadata operation failed (80131187) : Inconsistent method declarations in duplicated types (types: Importer; methods: import): (0x0600005c). [S:\vianova\Application\OpenTNF\OpenTNF.vcxproj] Importer.obj : error LNK2022: metadata operation failed (80131188) : Inconsistent field declarations in duplicated types (types: Importer; fields: m_modelInfo): (0x040003e9). [S:\vianova\Application\OpenTNF\OpenTNF.vcxproj] LINK : fatal error LNK1255: link failed because of metadata errors [S:\vianova\Application\OpenTNF\OpenTNF.vcxproj] Done Building Project "S:\vianova\Application\OpenTNF\OpenTNF.vcxproj" (Build target(s)) -- FAILED. Build FAILED. "S:\vianova\Application\OpenTNF\OpenTNF.vcxproj" (Build target) (1) -> (ClCompile target) -> FeatureCatalog.cpp(1372): warning C4146: unary minus operator applied to unsigned type, result still unsigned [S:\vianova\Application\OpenTNF\OpenTNF.vcxproj] FeatureCatalog.cpp(1674): warning C4146: unary minus operator applied to unsigned type, result still unsigned [S:\vianova\Application\OpenTNF\OpenTNF.vcxproj] "S:\vianova\Application\OpenTNF\OpenTNF.vcxproj" (Build target) (1) -> (Link target) -> FeatureCatalog.obj : error LNK2022: metadata operation failed (80131187) : Inconsistent method declarations in duplicated types (types: Importer; methods: import): (0x060000cb). [S:\vianova\Application\OpenTNF\OpenTNF.vcxproj] FeatureCatalog.obj : error LNK2022: metadata operation failed (80131188) : Inconsistent field declarations in duplicated types (types: Importer; fields: m_modelInfo): (0x04000440). [S:\vianova\Application\OpenTNF\OpenTNF.vcxproj] Importer.obj : error LNK2022: metadata operation failed (80131187) : Inconsistent method declarations in duplicated types (types: Importer; methods: import): (0x0600005c). [S:\vianova\Application\OpenTNF\OpenTNF.vcxproj] Importer.obj : error LNK2022: metadata operation failed (80131188) : Inconsistent field declarations in duplicated types (types: Importer; fields: m_modelInfo): (0x040003e9). [S:\vianova\Application\OpenTNF\OpenTNF.vcxproj] LINK : fatal error LNK1255: link failed because of metadata errors [S:\vianova\Application\OpenTNF\OpenTNF.vcxproj] 2 Warning(s) 5 Error(s) Time Elapsed 00:00:16.98 Program returned code : 1
Error Run DOS Command / Batch File CPPUnit [ e:\SVN\DCM-DIST\branches\NP21.00_STABLE\Novapoint\Binaries\Vianova.Core.Math.Tin.HalfEdge.Tests.Console.exe ] 08:40:33 08:40:50 00:00:16 View
Executing external process: C:\Windows\system32\cmd.exe Starting Directory: e:\SVN\DCM-DIST\branches\NP21.00_STABLE\Novapoint\Binaries Parameters: /c e:\SVN\DCM-DIST\branches\NP21.00_STABLE\Novapoint\Binaries\Vianova.Core.Math.Tin.HalfEdge.Tests.Console.exe Output from C:\Windows\system32\cmd.exe ...........................................................................F............................................................................................................................................................................................................................................................................................................................................................................................................................................................................. !!!FAILURES!!! Test Results: Run: 536 Failures: 1 Errors: 0 1) test: MathTinHalfEdgeCppUnitTests::TestMeshesIntersection::TestComparisonTouchingAndPiercingBase (F) line: 353 ..\Vianova.Core.Math.Tin.HalfEdge.CppUnitTest\Source\CppUnitExtensions.cpp assertion failed - Expression: result - Wrong, different point value or sequence between expected and actual IntersectionLine Program returned code : 1