FinalBuilder 6 LogFile for DCM_Build.fbz7

Project File : e:\SVN\DCM\trunk\build\DCM_Build.fbl7
Log Title : DCM_Build.fbz7
Date : 14/02/2019
Start Time : 12:18:59
End Time : 14:08:45
Run Time : 01:49:46

Status Action Name Description Start Time End Time Run Time Output
Show All
Hide All
Error Execute Program Build Unit Test Projects 13:34:20 13:51:27 00:17:07 View
Executing external process: C:\Program Files (x86)\MSBuild\14.0\Bin\MSBuild.exe Starting Directory: s: Parameters: "vianova\Novapoint\Core\Modeler\DesignShapes\Tests\Novapoint.Core.Modeler.DesignShapes.Tests.vcxproj" /t:Build /p:Configuration=Release /p:TargetFrameworkVersion=v4.6.1 /p:PlatformToolset=v140 /p:Platform=x64 Output from C:\Program Files (x86)\MSBuild\14.0\Bin\MSBuild.exe Microsoft (R) Build Engine version 14.0.25123.0 Copyright (C) Microsoft Corporation. All rights reserved. Build started 14.02.2019 13:34:20. Project "S:\vianova\Novapoint\Core\Modeler\DesignShapes\Tests\Novapoint.Core.Modeler.DesignShapes.Tests.vcxproj" on node 1 (Build target(s)). InitializeBuildStatus: Creating "U:\\Novapoint.Core.Modeler.DesignShapes.Tests\Release\Novapoin.69AED2E9.tlog\unsuccessfulbuild" because "AlwaysCreate" was specified. ClCompile: All outputs are up-to-date. C:\Program Files (x86)\Microsoft Visual Studio 14.0\VC\bin\x86_amd64\CL.exe /c /I.\ /I"C:\Program Files (x86)\Microsoft Visual Studio 14.0\VC\UnitTest\include" /IT:\Inc\Third_Party_Products\nvdb\inc /Zi /nologo /W3 /WX- /sdl /MP /O2 /Ob2 /Oi /Ot /GL /D NDEBUG /D _CONSOLE /D _UNICODE /D UNICODE /Gm- /EHsc /MD /GS /Gy /fp:precise /Zc:wchar_t /Zc:forScope /Zc:inline /Yu"stdafx.h" /Fp"U:\\Novapoint.Core.Modeler.DesignShapes.Tests\Release\Novapoint.Core.Modeler.DesignShapes.Tests.pch" /Fo"U:\\Novapoint.Core.Modeler.DesignShapes.Tests\Release\\" /Fd"U:\\Novapoint.Core.Modeler.DesignShapes.Tests\Release\vc140.pdb" /Gd /TP /errorReport:queue Main.cpp PrintResults.cpp SectionsBuilder.cpp UnitTests\TestBuildFromSections.cpp UnitTests\TestBuildSurfaces.cpp UnitTests\TestDesignModel.cpp UnitTests\TestDesignModelBuildVolume.cpp UnitTests\TestDesignModelConstructionBed.cpp UnitTests\TestDesignModelRoadBedSurface.cpp UnitTests\TestIntersectingSections.cpp UnitTests\TestRealModelsFromFiles.cpp UnitTests\TestSectionsAndTerrain.cpp Main.cpp PrintResults.cpp SectionsBuilder.cpp TestBuildFromSections.cpp TestBuildSurfaces.cpp TestDesignModel.cpp TestDesignModelBuildVolume.cpp TestDesignModelConstructionBed.cpp TestDesignModelRoadBedSurface.cpp TestIntersectingSections.cpp TestRealModelsFromFiles.cpp TestSectionsAndTerrain.cpp Link: C:\Program Files (x86)\Microsoft Visual Studio 14.0\VC\bin\x86_amd64\link.exe /ERRORREPORT:QUEUE /OUT:"T:\Novapoint\\Binaries\Novapoint.Core.Modeler.DesignShapes.Tests.exe" /INCREMENTAL:NO /NOLOGO /LIBPATH:T:\Lib\\Third_Party_Products\nvdb cppunit.lib kernel32.lib user32.lib gdi32.lib winspool.lib comdlg32.lib advapi32.lib shell32.lib ole32.lib oleaut32.lib uuid.lib odbc32.lib odbccp32.lib /MANIFEST /MANIFESTUAC:"level='asInvoker' uiAccess='false'" /manifest:embed /Debug /PDB:"T:\Novapoint\\Binaries\Novapoint.Core.Modeler.DesignShapes.Tests.pdb" /SUBSYSTEM:CONSOLE /OPT:REF /OPT:ICF /LTCG:incremental /TLBID:1 /DYNAMICBASE /NXCOMPAT /IMPLIB:"T:\Novapoint\\Binaries\Novapoint.Core.Modeler.DesignShapes.Tests.lib" /MACHINE:X64 U:\\Novapoint.Core.Modeler.DesignShapes.Tests\Release\DXFDumper.obj U:\\Novapoint.Core.Modeler.DesignShapes.Tests\Release\Main.obj U:\\Novapoint.Core.Modeler.DesignShapes.Tests\Release\PrintResults.obj U:\\Novapoint.Core.Modeler.DesignShapes.Tests\Release\SectionsBuilder.obj U:\\Novapoint.Core.Modeler.DesignShapes.Tests\Release\stdafx.obj U:\\Novapoint.Core.Modeler.DesignShapes.Tests\Release\TestBuildFromSections.obj U:\\Novapoint.Core.Modeler.DesignShapes.Tests\Release\TestBuildSurfaces.obj U:\\Novapoint.Core.Modeler.DesignShapes.Tests\Release\TestDesignModel.obj U:\\Novapoint.Core.Modeler.DesignShapes.Tests\Release\TestDesignModelBuildVolume.obj U:\\Novapoint.Core.Modeler.DesignShapes.Tests\Release\TestDesignModelConstructionBed.obj U:\\Novapoint.Core.Modeler.DesignShapes.Tests\Release\TestDesignModelRoadBedSurface.obj U:\\Novapoint.Core.Modeler.DesignShapes.Tests\Release\TestIntersectingSections.obj U:\\Novapoint.Core.Modeler.DesignShapes.Tests\Release\TestRealModelsFromFiles.obj U:\\Novapoint.Core.Modeler.DesignShapes.Tests\Release\TestSectionsAndTerrain.obj Generating code s:\vianova\novapoint\core\modeler\designshapes\tests\unittests\testdesignmodel.cpp(38): fatal error C1002: compiler is out of heap space in pass 2 [S:\vianova\Novapoint\Core\Modeler\DesignShapes\Tests\Novapoint.Core.Modeler.DesignShapes.Tests.vcxproj] LINK : fatal error LNK1257: code generation failed [S:\vianova\Novapoint\Core\Modeler\DesignShapes\Tests\Novapoint.Core.Modeler.DesignShapes.Tests.vcxproj] Done Building Project "S:\vianova\Novapoint\Core\Modeler\DesignShapes\Tests\Novapoint.Core.Modeler.DesignShapes.Tests.vcxproj" (Build target(s)) -- FAILED. Build FAILED. "S:\vianova\Novapoint\Core\Modeler\DesignShapes\Tests\Novapoint.Core.Modeler.DesignShapes.Tests.vcxproj" (Build target) (1) -> (Link target) -> s:\vianova\novapoint\core\modeler\designshapes\tests\unittests\testdesignmodel.cpp(38): fatal error C1002: compiler is out of heap space in pass 2 [S:\vianova\Novapoint\Core\Modeler\DesignShapes\Tests\Novapoint.Core.Modeler.DesignShapes.Tests.vcxproj] LINK : fatal error LNK1257: code generation failed [S:\vianova\Novapoint\Core\Modeler\DesignShapes\Tests\Novapoint.Core.Modeler.DesignShapes.Tests.vcxproj] 0 Warning(s) 2 Error(s) Time Elapsed 00:17:06.51 Program returned code : 1