FinalBuilder 6 LogFile for DCM_Build.fbz7

Project File : C:\Users\build\AppData\Local\Temp\FBTF6CE.fbl7
Log Title : DCM_Build.fbz7
Date : 18/02/2019
Start Time : 06:38:54
End Time : 07:08:50
Run Time : 00:29:56

Status Action Name Description Start Time End Time Run Time Output
Show All
Hide All
Error Run DOS Command / Batch File CPPUnit [ e:\SVN\DCM-DIST\branches\NP21.00_STABLE\Novapoint\Binaries\Vianova.Core.Math.Tin.HalfEdge.Tests.Console.exe ] 07:07:39 07:07:55 00:00:16 View
Executing external process: C:\Windows\system32\cmd.exe Starting Directory: e:\SVN\DCM-DIST\branches\NP21.00_STABLE\Novapoint\Binaries Parameters: /c e:\SVN\DCM-DIST\branches\NP21.00_STABLE\Novapoint\Binaries\Vianova.Core.Math.Tin.HalfEdge.Tests.Console.exe Output from C:\Windows\system32\cmd.exe ...........................................................................F............................................................................................................................................................................................................................................................................................................................................................................................................................................................................. !!!FAILURES!!! Test Results: Run: 536 Failures: 1 Errors: 0 1) test: MathTinHalfEdgeCppUnitTests::TestMeshesIntersection::TestComparisonTouchingAndPiercingBase (F) line: 353 ..\Vianova.Core.Math.Tin.HalfEdge.CppUnitTest\Source\CppUnitExtensions.cpp assertion failed - Expression: result - Wrong, different point value or sequence between expected and actual IntersectionLine Program returned code : 1
Error Run DOS Command / Batch File CPPUnit [ e:\SVN\DCM-DIST\branches\NP21.00_STABLE\Novapoint\Binaries\Vianova.Core.NetworkFeatureValidator.UnitTest.exe ] 07:07:57 07:07:58 00:00:00 View
Executing external process: C:\Windows\system32\cmd.exe Starting Directory: e:\SVN\DCM-DIST\branches\NP21.00_STABLE\Novapoint\Binaries Parameters: /c e:\SVN\DCM-DIST\branches\NP21.00_STABLE\Novapoint\Binaries\Vianova.Core.NetworkFeatureValidator.UnitTest.exe Output from C:\Windows\system32\cmd.exe Test_ExistsRule Test_ExistsRule/test_ValueExistsRule Test_ExistsRule.cpp:65: Assertion failed: report.hasErrors() Test_OrRule Test_OrRule/test_OrRule Test_OrRule.cpp:78: Assertion failed: report.hasErrors() Test_ValueIsOneOf === Test Report === Test_ExistsRule/test_ValueExistsRule: FAILED (assertion 1) Test_ExistsRule.cpp:65: Assertion failed: report.hasErrors() Test_OrRule/test_OrRule: FAILED (assertion 1) Test_OrRule.cpp:78: Assertion failed: report.hasErrors() Test_ValueIsOneOf/test_ExistsRule Test_ValueIsOneOf.cpp:91: Assertion failed: report.hasErrors() Test_ValueIsOneOf/test_ExistsRule: FAILED (assertion 1) Test_ValueIsOneOf.cpp:91: Assertion failed: report.hasErrors() 0 assertions passed. 0 tests passed. 3 tests failed. === TESTS FAILED === Program returned code : 3