FinalBuilder 6 LogFile for DCM_Build.fbz7

Project File : C:\Users\build\AppData\Local\Temp\FBT2701.fbl7
Log Title : DCM_Build.fbz7
Date : 19/02/2019
Start Time : 10:34:38
End Time : 18:16:18
Run Time : 07:41:39

Status Action Name Description Start Time End Time Run Time Output
Show All
Hide All
Error Execute Program Build Unit Test Projects 11:55:24 18:05:16 06:09:51 View
Executing external process: C:\Program Files (x86)\MSBuild\14.0\Bin\MSBuild.exe Starting Directory: s: Parameters: "vianova\Novapoint\Core\Modeler\DesignShapes\Tests\Novapoint.Core.Modeler.DesignShapes.Tests.vcxproj" /t:Build /p:Configuration=Release /p:TargetFrameworkVersion=v4.6.1 /p:PlatformToolset=v140 /p:Platform=x64 Output from C:\Program Files (x86)\MSBuild\14.0\Bin\MSBuild.exe Microsoft (R) Build Engine version 14.0.25123.0 Copyright (C) Microsoft Corporation. All rights reserved. Build started 19.02.2019 11:55:24. Project "S:\vianova\Novapoint\Core\Modeler\DesignShapes\Tests\Novapoint.Core.Modeler.DesignShapes.Tests.vcxproj" on node 1 (Build target(s)). InitializeBuildStatus: Touching "U:\\Novapoint.Core.Modeler.DesignShapes.Tests\Release\Novapoin.69AED2E9.tlog\unsuccessfulbuild". ClCompile: All outputs are up-to-date. All outputs are up-to-date. Link: C:\Program Files (x86)\Microsoft Visual Studio 14.0\VC\bin\x86_amd64\link.exe /ERRORREPORT:QUEUE /OUT:"T:\Novapoint\\Binaries\Novapoint.Core.Modeler.DesignShapes.Tests.exe" /INCREMENTAL:NO /NOLOGO /LIBPATH:T:\Lib\\Third_Party_Products\nvdb cppunit.lib kernel32.lib user32.lib gdi32.lib winspool.lib comdlg32.lib advapi32.lib shell32.lib ole32.lib oleaut32.lib uuid.lib odbc32.lib odbccp32.lib /MANIFEST /MANIFESTUAC:"level='asInvoker' uiAccess='false'" /manifest:embed /Debug /PDB:"T:\Novapoint\\Binaries\Novapoint.Core.Modeler.DesignShapes.Tests.pdb" /SUBSYSTEM:CONSOLE /OPT:REF /OPT:ICF /LTCG:incremental /TLBID:1 /DYNAMICBASE /NXCOMPAT /IMPLIB:"T:\Novapoint\\Binaries\Novapoint.Core.Modeler.DesignShapes.Tests.lib" /MACHINE:X64 U:\\Novapoint.Core.Modeler.DesignShapes.Tests\Release\DXFDumper.obj U:\\Novapoint.Core.Modeler.DesignShapes.Tests\Release\Main.obj U:\\Novapoint.Core.Modeler.DesignShapes.Tests\Release\PrintResults.obj U:\\Novapoint.Core.Modeler.DesignShapes.Tests\Release\SectionsBuilder.obj U:\\Novapoint.Core.Modeler.DesignShapes.Tests\Release\stdafx.obj U:\\Novapoint.Core.Modeler.DesignShapes.Tests\Release\TestBuildFromSections.obj U:\\Novapoint.Core.Modeler.DesignShapes.Tests\Release\TestBuildSurfaces.obj U:\\Novapoint.Core.Modeler.DesignShapes.Tests\Release\TestDesignModel.obj U:\\Novapoint.Core.Modeler.DesignShapes.Tests\Release\TestDesignModelBuildVolume.obj U:\\Novapoint.Core.Modeler.DesignShapes.Tests\Release\TestDesignModelConstructionBed.obj U:\\Novapoint.Core.Modeler.DesignShapes.Tests\Release\TestDesignModelRoadBedSurface.obj U:\\Novapoint.Core.Modeler.DesignShapes.Tests\Release\TestIntersectingSections.obj U:\\Novapoint.Core.Modeler.DesignShapes.Tests\Release\TestRealModelsFromFiles.obj U:\\Novapoint.Core.Modeler.DesignShapes.Tests\Release\TestSectionsAndTerrain.obj Generating code c:\program files (x86)\microsoft visual studio 14.0\vc\include\vector(1244): fatal error C1001: An internal error has occurred in the compiler. [S:\vianova\Novapoint\Core\Modeler\DesignShapes\Tests\Novapoint.Core.Modeler.DesignShapes.Tests.vcxproj] (compiler file 'f:\dd\vctools\compiler\utc\src\p2\main.c', line 249) To work around this problem, try simplifying or changing the program near the locations listed above. Please choose the Technical Support command on the Visual C++ Help menu, or open the Technical Support help file for more information Internal Compiler Error in C:\Program Files (x86)\Microsoft Visual Studio 14.0\VC\bin\x86_amd64\link.exe. You will be prompted to send an error report to Microsoft later. s:\vianova\novapoint\core\modeler\designshapes\tests\unittests\testdesignmodel.cpp(38): fatal error C1002: compiler is out of heap space in pass 2 [S:\vianova\Novapoint\Core\Modeler\DesignShapes\Tests\Novapoint.Core.Modeler.DesignShapes.Tests.vcxproj] LINK : fatal error LNK1257: code generation failed [S:\vianova\Novapoint\Core\Modeler\DesignShapes\Tests\Novapoint.Core.Modeler.DesignShapes.Tests.vcxproj] Program returned code : 1
Error Run DOS Command / Batch File CPPUnit [ e:\SVN\DCM-DIST\branches\NP21.00_STABLE\Novapoint\Binaries\Vianova.Core.NetworkFeatureValidator.UnitTest.exe ] 18:15:55 18:15:55 00:00:00 View
Executing external process: C:\Windows\system32\cmd.exe Starting Directory: e:\SVN\DCM-DIST\branches\NP21.00_STABLE\Novapoint\Binaries Parameters: /c e:\SVN\DCM-DIST\branches\NP21.00_STABLE\Novapoint\Binaries\Vianova.Core.NetworkFeatureValidator.UnitTest.exe Output from C:\Windows\system32\cmd.exe Test_ExistsRule Test_ExistsRule/test_ValueExistsRule Test_ExistsRule.cpp:65: Assertion failed: report.hasErrors() Test_OrRule Test_OrRule/test_OrRule Test_OrRule.cpp:78: Assertion failed: report.hasErrors() === Test Report === Test_ExistsRule/test_ValueExistsRule: FAILED (assertion 1) Test_ExistsRule.cpp:65: Assertion failed: report.hasErrors() Test_OrRule/test_OrRule: FAILED (assertion 1) Test_OrRule.cpp:78: Assertion failed: report.hasErrors() Test_ValueIsOneOf Test_ValueIsOneOf/test_ExistsRule Test_ValueIsOneOf.cpp:91: Assertion failed: report.hasErrors() Test_ValueIsOneOf/test_ExistsRule: FAILED (assertion 1) Test_ValueIsOneOf.cpp:91: Assertion failed: report.hasErrors() 0 assertions passed. 0 tests passed. 3 tests failed. === TESTS FAILED === Program returned code : 3