FinalBuilder 6 LogFile for DCM_Build.fbz7

Project File : C:\Users\build\AppData\Local\Temp\FBTC126.fbl7
Log Title : DCM_Build.fbz7
Date : 20/02/2019
Start Time : 08:01:59
End Time : 08:49:55
Run Time : 00:47:55

Status Action Name Description Start Time End Time Run Time Output
Show All
Hide All
Error Execute Program MSBuild vianova\Application\OpenTNF\OpenTNF.vcxproj (/Build) 08:19:41 08:19:55 00:00:14 View
Executing external process: C:\Program Files (x86)\MSBuild\14.0\Bin\MSBuild.exe Starting Directory: S: Parameters: "vianova\Application\OpenTNF\OpenTNF.vcxproj" /t:Build /p:Configuration=Release /p:TargetFrameworkVersion=v4.6.1 /p:PlatformToolset=v140 /p:Platform=x64 Output from C:\Program Files (x86)\MSBuild\14.0\Bin\MSBuild.exe Microsoft (R) Build Engine version 14.0.25123.0 Copyright (C) Microsoft Corporation. All rights reserved. Build started 20.02.2019 08:19:41. Project "S:\vianova\Application\OpenTNF\OpenTNF.vcxproj" on node 1 (Build target(s)). InitializeBuildStatus: Creating "U:\\OpenTNF\Release\OpenTNF.tlog\unsuccessfulbuild" because "AlwaysCreate" was specified. PreBuildEvent: copy app.config "T:\Novapoint\OpenTNF.exe.config" :VCEnd 1 file(s) copied. GenerateTargetFrameworkMonikerAttribute: Skipping target "GenerateTargetFrameworkMonikerAttribute" because all output files are up-to-date with respect to the input files. ClCompile: All outputs are up-to-date. C:\Program Files (x86)\Microsoft Visual Studio 14.0\VC\bin\x86_amd64\CL.exe /c /IT:\Inc\Third_Party_Products\nvdb\inc /AI"C:\Program Files (x86)\Reference Assemblies\Microsoft\Framework\.NETFramework\v4.6.1\\" /AI"C:\Program Files (x86)\Windows Kits\8.1\References\CommonConfiguration\Neutral" /AI"C:\Program Files (x86)\Reference Assemblies\Microsoft\Framework\.NETFramework\v4.6.1\Facades\\" /Zi /clr /nologo /W3 /WX- /MP /O2 /Ob2 /Ot /D WIN32 /D NDEBUG /D ENABLE_LANDCODE /D _UNICODE /D UNICODE /EHa /MD /GS /fp:precise /Zc:wchar_t /Zc:forScope /Zc:inline /Yu"stdafx.h" /Fp"U:\\OpenTNF\Release\OpenTNF.pch" /Fo"U:\\OpenTNF\Release\\" /Fd"U:\\OpenTNF\Release\vc140.pdb" /TP /FUT:\Novapoint\\3rdParty\Quadri\log4net.dll /FU"C:\Program Files (x86)\Reference Assemblies\Microsoft\Framework\.NETFramework\v4.6.1\mscorlib.dll" /FUT:\Novapoint\\Binaries\Novapoint.Core.QuadriModel.dll /FUT:\Novapoint\\3rdParty\GeoPackage\OpenTNF.Library.dll /FU"C:\Program Files (x86)\Reference Assemblies\Microsoft\Framework\.NETFramework\v4.6.1\System.Configuration.dll" /FU"C:\Program Files (x86)\Reference Assemblies\Microsoft\Framework\.NETFramework\v4.6.1\System.Core.dll" /FU"C:\Program Files (x86)\Reference Assemblies\Microsoft\Framework\.NETFramework\v4.6.1\System.Data.dll" /FUT:\Novapoint\\3rdParty\GeoPackage\System.Data.SQLite.dll /FU"C:\Program Files (x86)\Reference Assemblies\Microsoft\Framework\.NETFramework\v4.6.1\System.dll" /FU"C:\Program Files (x86)\Reference Assemblies\Microsoft\Framework\.NETFramework\v4.6.1\System.Xml.dll" /FUT:\Novapoint\\3rdParty\GeoPackage\Triona.TNE.Common.dll /FUT:\Novapoint\\3rdParty\GeoPackage\Triona.TNE.Geometry.dll /FUT:\Novapoint\\3rdParty\GeoPackage\Triona.TNE.Geometry.GeoPackage.dll /FUT:\Novapoint\\Binaries\Vianova.Core.dll /FUT:\Novapoint\\Binaries\Vianova.Core.Exceptions.dll /FUT:\Novapoint\\Binaries\Vianova.Core.Math.dll /errorReport:queue /clr:nostdlib import\Importer.cpp Importer.cpp All outputs are up-to-date. ManagedIncrementalBuildPostProcessDependencyGraph: To improve incremental build performance for managed components, please make sure that the 'VC++ Directories->Reference Directories' points to all the paths which contain the referenced managed assemblies. Could not load file or assembly 'System.Core, Version=2.0.5.0, Culture=neutral, PublicKeyToken=7cec85d7bea7798e, Retargetable=Yes' or one of its dependencies. The system cannot find the file specified. To improve incremental build performance for managed components, please make sure that the 'VC++ Directories->Reference Directories' points to all the paths which contain the referenced managed assemblies. Could not load file or assembly 'System, Version=2.0.5.0, Culture=neutral, PublicKeyToken=7cec85d7bea7798e, Retargetable=Yes' or one of its dependencies. The system cannot find the file specified. To improve incremental build performance for managed components, please make sure that the 'VC++ Directories->Reference Directories' points to all the paths which contain the referenced managed assemblies. Could not load file or assembly 'Vianova.Core, Version=21.0.24086.0, Culture=neutral, PublicKeyToken=null' or one of its dependencies. The system cannot find the file specified. CoreResGen: No resources are out of date with respect to their source files. Skipping resource generation. ResourceCompile: All outputs are up-to-date. Link: C:\Program Files (x86)\Microsoft Visual Studio 14.0\VC\bin\x86_amd64\link.exe /ERRORREPORT:QUEUE /OUT:"T:\Novapoint\OpenTNF.exe" /NOLOGO /LIBPATH:T:\Lib\\Third_Party_Products\nvdb /LIBPATH:T:\Lib\\Third_Party_Products\nvdb Delayimp.lib /ASSEMBLYRESOURCE:U:\\OpenTNF\Release\OpenTNF.OpenTnfTypes.resources /ASSEMBLYRESOURCE:"U:\\OpenTNF\Release\OpenTNF.Resources.resources,OpenTNF.Resources.resources" /DELAYLOAD:NPROJECT.DLL /DELAYLOAD:NCOMMONPROPERTIES.DLL /DELAYLOAD:NQUADRICOMMONSETUP.DLL /DELAYLOAD:CALENDARTOOLS.DLL /DELAYLOAD:NmNVDBMod.dll /DELAYLOAD:NQuadriModelBuilder.dll /DELAYLOAD:Novapoint.Core.IO.Quadri.TypeRegistry.dll /DELAYLOAD:NFileStorage.dll /DELAYLOAD:Quadri.Math.dll /MANIFEST /MANIFESTUAC:"level='asInvoker' uiAccess='false'" /manifest:embed /PDB:"T:\Novapoint\OpenTNF.pdb" /OPT:REF /TLBID:1 /DYNAMICBASE /FIXED:NO /NXCOMPAT /MACHINE:X64 U:\\OpenTNF\Release\app.res U:\\OpenTNF\Release\AreaOfInterest.obj U:\\OpenTNF\Release\AssemblyInfo.obj U:\\OpenTNF\Release\AttributeProcessor.obj U:\\OpenTNF\Release\CommandLineParser.obj U:\\OpenTNF\Release\Config.obj U:\\OpenTNF\Release\Exporter.obj U:\\OpenTNF\Release\FeatureCatalog.obj U:\\OpenTNF\Release\Importer.obj U:\\OpenTNF\Release\TnfLinkSequenceManager.obj U:\\OpenTNF\Release\MockApplication.obj U:\\OpenTNF\Release\MockConfiguration.obj U:\\OpenTNF\Release\OpenTNF.obj U:\\OpenTNF\Release\stdafx.obj U:\\OpenTNF\Release\TaskInformation.obj U:\\OpenTNF\Release\TranslateFeatureCatalog.obj "U:\\OpenTNF\Release\.NETFramework,Version=v4.6.1.AssemblyAttributes.obj" Importer.obj : error LNK2022: metadata operation failed (80131187) : Inconsistent method declarations in duplicated types (types: Importer; methods: import): (0x0600005c). [S:\vianova\Application\OpenTNF\OpenTNF.vcxproj] Importer.obj : error LNK2022: metadata operation failed (80131188) : Inconsistent field declarations in duplicated types (types: Importer; fields: m_modelInfo): (0x040003e9). [S:\vianova\Application\OpenTNF\OpenTNF.vcxproj] LINK : fatal error LNK1255: link failed because of metadata errors [S:\vianova\Application\OpenTNF\OpenTNF.vcxproj] Done Building Project "S:\vianova\Application\OpenTNF\OpenTNF.vcxproj" (Build target(s)) -- FAILED. Build FAILED. "S:\vianova\Application\OpenTNF\OpenTNF.vcxproj" (Build target) (1) -> (Link target) -> Importer.obj : error LNK2022: metadata operation failed (80131187) : Inconsistent method declarations in duplicated types (types: Importer; methods: import): (0x0600005c). [S:\vianova\Application\OpenTNF\OpenTNF.vcxproj] Importer.obj : error LNK2022: metadata operation failed (80131188) : Inconsistent field declarations in duplicated types (types: Importer; fields: m_modelInfo): (0x040003e9). [S:\vianova\Application\OpenTNF\OpenTNF.vcxproj] LINK : fatal error LNK1255: link failed because of metadata errors [S:\vianova\Application\OpenTNF\OpenTNF.vcxproj] 0 Warning(s) 3 Error(s) Time Elapsed 00:00:13.82 Program returned code : 1
Error Execute Program Build Unit Test Projects 08:21:02 08:40:22 00:19:20 View
Executing external process: C:\Program Files (x86)\MSBuild\14.0\Bin\MSBuild.exe Starting Directory: s: Parameters: "vianova\Novapoint\Core\Modeler\DesignShapes\Tests\Novapoint.Core.Modeler.DesignShapes.Tests.vcxproj" /t:Build /p:Configuration=Release /p:TargetFrameworkVersion=v4.6.1 /p:PlatformToolset=v140 /p:Platform=x64 Output from C:\Program Files (x86)\MSBuild\14.0\Bin\MSBuild.exe Microsoft (R) Build Engine version 14.0.25123.0 Copyright (C) Microsoft Corporation. All rights reserved. Build started 20.02.2019 08:21:02. Project "S:\vianova\Novapoint\Core\Modeler\DesignShapes\Tests\Novapoint.Core.Modeler.DesignShapes.Tests.vcxproj" on node 1 (Build target(s)). InitializeBuildStatus: Touching "U:\\Novapoint.Core.Modeler.DesignShapes.Tests\Release\Novapoin.69AED2E9.tlog\unsuccessfulbuild". ClCompile: All outputs are up-to-date. All outputs are up-to-date. Link: C:\Program Files (x86)\Microsoft Visual Studio 14.0\VC\bin\x86_amd64\link.exe /ERRORREPORT:QUEUE /OUT:"T:\Novapoint\\Binaries\Novapoint.Core.Modeler.DesignShapes.Tests.exe" /INCREMENTAL:NO /NOLOGO /LIBPATH:T:\Lib\\Third_Party_Products\nvdb cppunit.lib kernel32.lib user32.lib gdi32.lib winspool.lib comdlg32.lib advapi32.lib shell32.lib ole32.lib oleaut32.lib uuid.lib odbc32.lib odbccp32.lib /MANIFEST /MANIFESTUAC:"level='asInvoker' uiAccess='false'" /manifest:embed /Debug /PDB:"T:\Novapoint\\Binaries\Novapoint.Core.Modeler.DesignShapes.Tests.pdb" /SUBSYSTEM:CONSOLE /OPT:REF /OPT:ICF /LTCG:incremental /TLBID:1 /DYNAMICBASE /NXCOMPAT /IMPLIB:"T:\Novapoint\\Binaries\Novapoint.Core.Modeler.DesignShapes.Tests.lib" /MACHINE:X64 U:\\Novapoint.Core.Modeler.DesignShapes.Tests\Release\DXFDumper.obj U:\\Novapoint.Core.Modeler.DesignShapes.Tests\Release\Main.obj U:\\Novapoint.Core.Modeler.DesignShapes.Tests\Release\PrintResults.obj U:\\Novapoint.Core.Modeler.DesignShapes.Tests\Release\SectionsBuilder.obj U:\\Novapoint.Core.Modeler.DesignShapes.Tests\Release\stdafx.obj U:\\Novapoint.Core.Modeler.DesignShapes.Tests\Release\TestBuildFromSections.obj U:\\Novapoint.Core.Modeler.DesignShapes.Tests\Release\TestBuildSurfaces.obj U:\\Novapoint.Core.Modeler.DesignShapes.Tests\Release\TestDesignModel.obj U:\\Novapoint.Core.Modeler.DesignShapes.Tests\Release\TestDesignModelBuildVolume.obj U:\\Novapoint.Core.Modeler.DesignShapes.Tests\Release\TestDesignModelConstructionBed.obj U:\\Novapoint.Core.Modeler.DesignShapes.Tests\Release\TestDesignModelRoadBedSurface.obj U:\\Novapoint.Core.Modeler.DesignShapes.Tests\Release\TestIntersectingSections.obj U:\\Novapoint.Core.Modeler.DesignShapes.Tests\Release\TestRealModelsFromFiles.obj U:\\Novapoint.Core.Modeler.DesignShapes.Tests\Release\TestSectionsAndTerrain.obj Generating code s:\vianova\novapoint\core\modeler\designshapes\tests\unittests\testdesignmodel.cpp(38): fatal error C1002: compiler is out of heap space in pass 2 [S:\vianova\Novapoint\Core\Modeler\DesignShapes\Tests\Novapoint.Core.Modeler.DesignShapes.Tests.vcxproj] LINK : fatal error LNK1257: code generation failed [S:\vianova\Novapoint\Core\Modeler\DesignShapes\Tests\Novapoint.Core.Modeler.DesignShapes.Tests.vcxproj] Done Building Project "S:\vianova\Novapoint\Core\Modeler\DesignShapes\Tests\Novapoint.Core.Modeler.DesignShapes.Tests.vcxproj" (Build target(s)) -- FAILED. Build FAILED. "S:\vianova\Novapoint\Core\Modeler\DesignShapes\Tests\Novapoint.Core.Modeler.DesignShapes.Tests.vcxproj" (Build target) (1) -> (Link target) -> s:\vianova\novapoint\core\modeler\designshapes\tests\unittests\testdesignmodel.cpp(38): fatal error C1002: compiler is out of heap space in pass 2 [S:\vianova\Novapoint\Core\Modeler\DesignShapes\Tests\Novapoint.Core.Modeler.DesignShapes.Tests.vcxproj] LINK : fatal error LNK1257: code generation failed [S:\vianova\Novapoint\Core\Modeler\DesignShapes\Tests\Novapoint.Core.Modeler.DesignShapes.Tests.vcxproj] 0 Warning(s) 2 Error(s) Time Elapsed 00:19:20.26 Program returned code : 1
Error Run DOS Command / Batch File CPPUnit [ e:\SVN\DCM-DIST\branches\NP21.00_STABLE\Novapoint\Binaries\Vianova.Core.NetworkFeatureValidator.UnitTest.exe ] 08:49:32 08:49:33 00:00:00 View
Executing external process: C:\Windows\system32\cmd.exe Starting Directory: e:\SVN\DCM-DIST\branches\NP21.00_STABLE\Novapoint\Binaries Parameters: /c e:\SVN\DCM-DIST\branches\NP21.00_STABLE\Novapoint\Binaries\Vianova.Core.NetworkFeatureValidator.UnitTest.exe Output from C:\Windows\system32\cmd.exe Test_ExistsRule Test_ExistsRule/test_ValueExistsRule Test_ExistsRule.cpp:65: Assertion failed: report.hasErrors() Test_OrRule Test_OrRule/test_OrRule Test_OrRule.cpp:78: Assertion failed: report.hasErrors() === Test Report === Test_ExistsRule/test_ValueExistsRule: FAILED (assertion 1) Test_ExistsRule.cpp:65: Assertion failed: report.hasErrors() Test_OrRule/test_OrRule: FAILED (assertion 1) Test_OrRule.cpp:78: Assertion failed: report.hasErrors() Test_ValueIsOneOf Test_ValueIsOneOf/test_ExistsRule Test_ValueIsOneOf.cpp:91: Assertion failed: report.hasErrors() Test_ValueIsOneOf/test_ExistsRule: FAILED (assertion 1) Test_ValueIsOneOf.cpp:91: Assertion failed: report.hasErrors() 0 assertions passed. 0 tests passed. 3 tests failed. === TESTS FAILED === Program returned code : 3