FinalBuilder 6 LogFile for DCM_Build.fbz7

Project File : C:\Users\build\AppData\Local\Temp\FBTA463.fbl7
Log Title : DCM_Build.fbz7
Date : 27/02/2019
Start Time : 21:45:03
End Time : 23:45:41
Run Time : 02:00:38

Status Action Name Description Start Time End Time Run Time Output
Show All
Hide All
Error Run DOS Command / Batch File CPPUnit [ e:\SVN\DCM-DIST\branches\NP21.00_STABLE\Novapoint\Binaries\Novapoint.NvdbRoadReferenceSystem.UnitTest.exe ] 23:45:00 23:45:01 00:00:00 View
Executing external process: C:\Windows\system32\cmd.exe Starting Directory: e:\SVN\DCM-DIST\branches\NP21.00_STABLE\Novapoint\Binaries Parameters: /c e:\SVN\DCM-DIST\branches\NP21.00_STABLE\Novapoint\Binaries\Novapoint.NvdbRoadReferenceSystem.UnitTest.exe Output from C:\Windows\system32\cmd.exe Test_AddStrekning Test_AddStrekning/test_AddStrekningDEBUG: The project supports RoadReferenceSystem. DEBUG: Creating RoadBuilder for DataSet DEBUG: Creating RoadFormatter for DataSet ....................... Test_LocationalAttributeDirection === Test Report === Test_LocationalAttributeDirection/test_StrekningInOppositeDirection: FAILED (assertion 8) Test_LocationalAttributeDirection.cpp:63: sequences.size() != 1: "0" != "1". 102 assertions passed. 4 tests passed. Test_LocationalAttributeDirection/test_StrekningInOppositeDirectionDEBUG: The project supports RoadReferenceSystem. DEBUG: Creating RoadBuilder for DataSet DEBUG: Creating RoadFormatter for DataSet ....... Test_LocationalAttributeDirection.cpp:63: sequences.size() != 1: "0" != "1". Test_MunicipalityNumber Test_MunicipalityNumber/test_that_municipal_roads_are_splitDEBUG: The project supports RoadReferenceSystem. DEBUG: Creating RoadBuilder for DataSet 1 tests failed. === TESTS FAILED === DEBUG: Creating RoadFormatter for DataSet ................................ Test_MunicipalityNumber/test_that_county_roads_are_not_splitDEBUG: The project supports RoadReferenceSystem. DEBUG: Creating RoadBuilder for DataSet DEBUG: Creating RoadFormatter for DataSet ................. Test_RemoveStrekning Test_RemoveStrekning/test_RemoveStrekningDEBUG: The project supports RoadReferenceSystem. DEBUG: Creating RoadBuilder for DataSet DEBUG: Creating RoadFormatter for DataSet ....................... Program returned code : 1
Error Run DOS Command / Batch File CPPUnit [ e:\SVN\DCM-DIST\branches\NP21.00_STABLE\Novapoint\Binaries\Vianova.Core.Math.Tin.HalfEdge.Tests.Console.exe ] 23:45:02 23:45:17 00:00:15 View
Executing external process: C:\Windows\system32\cmd.exe Starting Directory: e:\SVN\DCM-DIST\branches\NP21.00_STABLE\Novapoint\Binaries Parameters: /c e:\SVN\DCM-DIST\branches\NP21.00_STABLE\Novapoint\Binaries\Vianova.Core.Math.Tin.HalfEdge.Tests.Console.exe Output from C:\Windows\system32\cmd.exe ......................................................................................................................................................................................................................................................................................................................................................................................................................F.................................................................................................................................. !!!FAILURES!!! Test Results: Run: 536 Failures: 1 Errors: 0 1) test: MathTinHalfEdgeCppUnitTests::TestMeshTriangle::TestCopyConstructorBoundary_Performance2 (F) line: 7737 ..\Vianova.Core.Math.Tin.HalfEdge.CppUnitTest\Source\TestMeshTriangle.cpp forced failure - Exceeded copy time: 312 ms time run (max time is 300 ms) Program returned code : 1