FinalBuilder 6 LogFile for DCM_Build.fbz7

Project File : C:\Users\build\AppData\Local\Temp\FBTDE4C.fbl7
Log Title : DCM_Build.fbz7
Date : 01/03/2019
Start Time : 21:22:40
End Time : 22:48:13
Run Time : 01:25:33

Status Action Name Description Start Time End Time Run Time Output
Show All
Hide All
Error Execute Program Build Unit Test Projects 22:36:56 22:36:59 00:00:02 View
Executing external process: C:\Program Files (x86)\MSBuild\14.0\Bin\MSBuild.exe Starting Directory: s: Parameters: "vianova\Novapoint\Core\UI\RenderPlugin\Tests\RenderPlugin.Tests.vcxproj" /t:Build /p:Configuration=Release /p:TargetFrameworkVersion=v4.6.1 /p:PlatformToolset=v140 /p:Platform=x64 Output from C:\Program Files (x86)\MSBuild\14.0\Bin\MSBuild.exe Microsoft (R) Build Engine version 14.0.25123.0 Copyright (C) Microsoft Corporation. All rights reserved. Build started 01.03.2019 22:36:56. Project "S:\vianova\Novapoint\Core\UI\RenderPlugin\Tests\RenderPlugin.Tests.vcxproj" on node 1 (Build target(s)). InitializeBuildStatus: Touching "U:\\Novapoint.Core.UI.RenderPlugin.Tests\Novapoin.121988F1.tlog\unsuccessfulbuild". GenerateTargetFrameworkMonikerAttribute: Skipping target "GenerateTargetFrameworkMonikerAttribute" because all output files are up-to-date with respect to the input files. ClCompile: C:\Program Files (x86)\Microsoft Visual Studio 14.0\VC\bin\x86_amd64\CL.exe /c /AI"C:\Program Files (x86)\Reference Assemblies\Microsoft\Framework\.NETFramework\v4.6.1\\" /AI"C:\Program Files (x86)\Windows Kits\8.1\References\CommonConfiguration\Neutral" /AI"C:\Program Files (x86)\Reference Assemblies\Microsoft\Framework\.NETFramework\v4.6.1\Facades\\" /Zi /clr /nologo /W3 /WX /MP /O2 /Ob0 /Ot /D WIN32 /D NDEBUG /D _WINDLL /D _UNICODE /D UNICODE /EHa /MD /GS /fp:precise /Zc:wchar_t /Zc:forScope /Zc:inline /Yc"stdafx.h" /Fp"U:\\Novapoint.Core.UI.RenderPlugin.Tests\Novapoint.Core.UI.RenderPlugin.Tests.pch" /Fo"U:\\Novapoint.Core.UI.RenderPlugin.Tests\\" /Fd"U:\\Novapoint.Core.UI.RenderPlugin.Tests\vc140.pdb" /TP /FUT:\Novapoint\3rdParty\DotNetZip\Ionic.Zip.dll /FU"C:\Program Files (x86)\Reference Assemblies\Microsoft\Framework\.NETFramework\v4.6.1\mscorlib.dll" /FUT:\Novapoint\Binaries\Novapoint.Core.IO.TaskSerializers.dll /FUT:\Novapoint\Binaries\Novapoint.Core.QuadriModel.dll /FUT:\Novapoint\Binaries\Novapoint.Core.UI.CadStyles.dll /FUT:\Novapoint\Binaries\Novapoint.Core.UI.RenderPlugin.dll /FUT:\Novapoint\Binaries\nunit.framework.dll /FU"C:\Program Files (x86)\Reference Assemblies\Microsoft\Framework\.NETFramework\v4.6.1\System.Data.dll" /FU"C:\Program Files (x86)\Reference Assemblies\Microsoft\Framework\.NETFramework\v4.6.1\System.dll" /FU"C:\Program Files (x86)\Reference Assemblies\Microsoft\Framework\.NETFramework\v4.6.1\System.Drawing.dll" /FU"C:\Program Files (x86)\Reference Assemblies\Microsoft\Framework\.NETFramework\v4.6.1\System.Xml.dll" /FUT:\Novapoint\Binaries\Vianova.Core.dll /FUT:\Novapoint\Binaries\Vianova.Core.Math.dll /FUT:\Novapoint\Binaries\Vianova.Core.UI.ObjectRenderSystem.dll /FUT:\Novapoint\Binaries\Vianova.UnitTests.CLR.dll /FUT:\Novapoint\Binaries\Vianova.UnitTests.dll /errorReport:queue /clr:nostdlib stdafx.cpp stdafx.cpp C:\Program Files (x86)\Microsoft Visual Studio 14.0\VC\bin\x86_amd64\CL.exe /c /AI"C:\Program Files (x86)\Reference Assemblies\Microsoft\Framework\.NETFramework\v4.6.1\\" /AI"C:\Program Files (x86)\Windows Kits\8.1\References\CommonConfiguration\Neutral" /AI"C:\Program Files (x86)\Reference Assemblies\Microsoft\Framework\.NETFramework\v4.6.1\Facades\\" /Zi /clr /nologo /W3 /WX /MP /O2 /Ob0 /Ot /D WIN32 /D NDEBUG /D _WINDLL /D _UNICODE /D UNICODE /EHa /MD /GS /fp:precise /Zc:wchar_t /Zc:forScope /Zc:inline /Yu"stdafx.h" /Fp"U:\\Novapoint.Core.UI.RenderPlugin.Tests\Novapoint.Core.UI.RenderPlugin.Tests.pch" /Fo"U:\\Novapoint.Core.UI.RenderPlugin.Tests\\" /Fd"U:\\Novapoint.Core.UI.RenderPlugin.Tests\vc140.pdb" /TP /FUT:\Novapoint\3rdParty\DotNetZip\Ionic.Zip.dll /FU"C:\Program Files (x86)\Reference Assemblies\Microsoft\Framework\.NETFramework\v4.6.1\mscorlib.dll" /FUT:\Novapoint\Binaries\Novapoint.Core.IO.TaskSerializers.dll /FUT:\Novapoint\Binaries\Novapoint.Core.QuadriModel.dll /FUT:\Novapoint\Binaries\Novapoint.Core.UI.CadStyles.dll /FUT:\Novapoint\Binaries\Novapoint.Core.UI.RenderPlugin.dll /FUT:\Novapoint\Binaries\nunit.framework.dll /FU"C:\Program Files (x86)\Reference Assemblies\Microsoft\Framework\.NETFramework\v4.6.1\System.Data.dll" /FU"C:\Program Files (x86)\Reference Assemblies\Microsoft\Framework\.NETFramework\v4.6.1\System.dll" /FU"C:\Program Files (x86)\Reference Assemblies\Microsoft\Framework\.NETFramework\v4.6.1\System.Drawing.dll" /FU"C:\Program Files (x86)\Reference Assemblies\Microsoft\Framework\.NETFramework\v4.6.1\System.Xml.dll" /FUT:\Novapoint\Binaries\Vianova.Core.dll /FUT:\Novapoint\Binaries\Vianova.Core.Math.dll /FUT:\Novapoint\Binaries\Vianova.Core.UI.ObjectRenderSystem.dll /FUT:\Novapoint\Binaries\Vianova.UnitTests.CLR.dll /FUT:\Novapoint\Binaries\Vianova.UnitTests.dll /errorReport:queue /clr:nostdlib AssemblyInfo.cpp UnitTests\AlignmentHandlerTests.cpp UnitTests\BoreholeRenderHandlerTests.cpp UnitTests\ColorStripeHandlerTests.cpp UnitTests\LineRenderHandlerTests.cpp UnitTests\MockApplication.cpp UnitTests\MockConfiguration.cpp UnitTests\MockRenderingClasses.cpp UnitTests\MockModel.cpp UnitTests\MockObjectItems.cpp UnitTests\PatternStyleHandlerTests.cpp UnitTests\PointRenderHandlerTest.cpp UnitTests\RenderFilterTests.cpp UnitTests\RenderHandlerUnitTests.cpp UnitTests\SolidRenderHandlerTests.cpp UnitTests\SurfaceRenderHandlerTests.cpp UnitTests\TerrainRenderHandlerTest.cpp UnitTests\TextRenderHandlerTest.cpp AssemblyInfo.cpp AlignmentHandlerTests.cpp BoreholeRenderHandlerTests.cpp ColorStripeHandlerTests.cpp LineRenderHandlerTests.cpp MockApplication.cpp MockConfiguration.cpp MockRenderingClasses.cpp MockModel.cpp MockObjectItems.cpp PatternStyleHandlerTests.cpp PointRenderHandlerTest.cpp RenderFilterTests.cpp RenderHandlerUnitTests.cpp SolidRenderHandlerTests.cpp SurfaceRenderHandlerTests.cpp TerrainRenderHandlerTest.cpp TextRenderHandlerTest.cpp UnitTests\SurfaceRenderHandlerTests.cpp(310): error C2039: 'GetItem': is not a member of 'Vianova::Novapoint::Core::QuadriSelection' [S:\vianova\Novapoint\Core\UI\RenderPlugin\Tests\RenderPlugin.Tests.vcxproj] UnitTests\SurfaceRenderHandlerTests.cpp(312): error C3536: 'occludedItem': cannot be used before it is initialized [S:\vianova\Novapoint\Core\UI\RenderPlugin\Tests\RenderPlugin.Tests.vcxproj] UnitTests\SurfaceRenderHandlerTests.cpp(312): error C2664: 'void Vianova::Novapoint::Core::UI::SurfaceRenderHandlerBase::Render(Vianova::Core::Model::IObjectItem ^,Vianova::Core::UI::ObjectRenderSystem::RenderArgs ^)': cannot convert argument 1 from 'int' to 'Vianova::Core::Model::IObjectItem ^' [S:\vianova\Novapoint\Core\UI\RenderPlugin\Tests\RenderPlugin.Tests.vcxproj] UnitTests\SurfaceRenderHandlerTests.cpp(312): note: No user-defined-conversion operator available, or UnitTests\SurfaceRenderHandlerTests.cpp(312): note: No standard conversion exists from the boxed form of the arithmetic type to the target type UnitTests\SurfaceRenderHandlerTests.cpp(314): error C2664: 'void Vianova::Novapoint::Core::UI::SurfaceRenderHandlerBase::Render(Vianova::Core::Model::IObjectItem ^,Vianova::Core::UI::ObjectRenderSystem::RenderArgs ^)': cannot convert argument 1 from 'int' to 'Vianova::Core::Model::IObjectItem ^' [S:\vianova\Novapoint\Core\UI\RenderPlugin\Tests\RenderPlugin.Tests.vcxproj] UnitTests\SurfaceRenderHandlerTests.cpp(314): note: No user-defined-conversion operator available, or UnitTests\SurfaceRenderHandlerTests.cpp(314): note: No standard conversion exists from the boxed form of the arithmetic type to the target type UnitTests\SolidRenderHandlerTests.cpp(296): error C2039: 'GetItem': is not a member of 'Vianova::Novapoint::Core::QuadriSelection' [S:\vianova\Novapoint\Core\UI\RenderPlugin\Tests\RenderPlugin.Tests.vcxproj] UnitTests\SolidRenderHandlerTests.cpp(298): error C3536: 'occludedItem': cannot be used before it is initialized [S:\vianova\Novapoint\Core\UI\RenderPlugin\Tests\RenderPlugin.Tests.vcxproj] UnitTests\SolidRenderHandlerTests.cpp(298): error C2664: 'void Vianova::Novapoint::Core::UI::SolidRenderHandlerBase::Render(Vianova::Core::Model::IObjectItem ^,Vianova::Core::UI::ObjectRenderSystem::RenderArgs ^)': cannot convert argument 1 from 'int' to 'Vianova::Core::Model::IObjectItem ^' [S:\vianova\Novapoint\Core\UI\RenderPlugin\Tests\RenderPlugin.Tests.vcxproj] UnitTests\SolidRenderHandlerTests.cpp(298): note: No user-defined-conversion operator available, or UnitTests\SolidRenderHandlerTests.cpp(298): note: No standard conversion exists from the boxed form of the arithmetic type to the target type UnitTests\SolidRenderHandlerTests.cpp(299): error C2664: 'void Vianova::Novapoint::Core::UI::SolidRenderHandlerBase::Render(Vianova::Core::Model::IObjectItem ^,Vianova::Core::UI::ObjectRenderSystem::RenderArgs ^)': cannot convert argument 1 from 'int' to 'Vianova::Core::Model::IObjectItem ^' [S:\vianova\Novapoint\Core\UI\RenderPlugin\Tests\RenderPlugin.Tests.vcxproj] UnitTests\SolidRenderHandlerTests.cpp(299): note: No user-defined-conversion operator available, or UnitTests\SolidRenderHandlerTests.cpp(299): note: No standard conversion exists from the boxed form of the arithmetic type to the target type Done Building Project "S:\vianova\Novapoint\Core\UI\RenderPlugin\Tests\RenderPlugin.Tests.vcxproj" (Build target(s)) -- FAILED. Build FAILED. "S:\vianova\Novapoint\Core\UI\RenderPlugin\Tests\RenderPlugin.Tests.vcxproj" (Build target) (1) -> (ClCompile target) -> UnitTests\SurfaceRenderHandlerTests.cpp(310): error C2039: 'GetItem': is not a member of 'Vianova::Novapoint::Core::QuadriSelection' [S:\vianova\Novapoint\Core\UI\RenderPlugin\Tests\RenderPlugin.Tests.vcxproj] UnitTests\SurfaceRenderHandlerTests.cpp(312): error C3536: 'occludedItem': cannot be used before it is initialized [S:\vianova\Novapoint\Core\UI\RenderPlugin\Tests\RenderPlugin.Tests.vcxproj] UnitTests\SurfaceRenderHandlerTests.cpp(312): error C2664: 'void Vianova::Novapoint::Core::UI::SurfaceRenderHandlerBase::Render(Vianova::Core::Model::IObjectItem ^,Vianova::Core::UI::ObjectRenderSystem::RenderArgs ^)': cannot convert argument 1 from 'int' to 'Vianova::Core::Model::IObjectItem ^' [S:\vianova\Novapoint\Core\UI\RenderPlugin\Tests\RenderPlugin.Tests.vcxproj] UnitTests\SurfaceRenderHandlerTests.cpp(314): error C2664: 'void Vianova::Novapoint::Core::UI::SurfaceRenderHandlerBase::Render(Vianova::Core::Model::IObjectItem ^,Vianova::Core::UI::ObjectRenderSystem::RenderArgs ^)': cannot convert argument 1 from 'int' to 'Vianova::Core::Model::IObjectItem ^' [S:\vianova\Novapoint\Core\UI\RenderPlugin\Tests\RenderPlugin.Tests.vcxproj] UnitTests\SolidRenderHandlerTests.cpp(296): error C2039: 'GetItem': is not a member of 'Vianova::Novapoint::Core::QuadriSelection' [S:\vianova\Novapoint\Core\UI\RenderPlugin\Tests\RenderPlugin.Tests.vcxproj] UnitTests\SolidRenderHandlerTests.cpp(298): error C3536: 'occludedItem': cannot be used before it is initialized [S:\vianova\Novapoint\Core\UI\RenderPlugin\Tests\RenderPlugin.Tests.vcxproj] UnitTests\SolidRenderHandlerTests.cpp(298): error C2664: 'void Vianova::Novapoint::Core::UI::SolidRenderHandlerBase::Render(Vianova::Core::Model::IObjectItem ^,Vianova::Core::UI::ObjectRenderSystem::RenderArgs ^)': cannot convert argument 1 from 'int' to 'Vianova::Core::Model::IObjectItem ^' [S:\vianova\Novapoint\Core\UI\RenderPlugin\Tests\RenderPlugin.Tests.vcxproj] UnitTests\SolidRenderHandlerTests.cpp(299): error C2664: 'void Vianova::Novapoint::Core::UI::SolidRenderHandlerBase::Render(Vianova::Core::Model::IObjectItem ^,Vianova::Core::UI::ObjectRenderSystem::RenderArgs ^)': cannot convert argument 1 from 'int' to 'Vianova::Core::Model::IObjectItem ^' [S:\vianova\Novapoint\Core\UI\RenderPlugin\Tests\RenderPlugin.Tests.vcxproj] 0 Warning(s) 8 Error(s) Time Elapsed 00:00:02.35 Program returned code : 1