FinalBuilder 6 LogFile for DCM_Build.fbz7

Project File : C:\Users\build\AppData\Local\Temp\FBTA688.fbl7
Log Title : DCM_Build.fbz7
Date : 07/03/2019
Start Time : 17:17:47
End Time : 18:52:42
Run Time : 01:34:55

Status Action Name Description Start Time End Time Run Time Output
Show All
Hide All
Error Execute Program MSBuild vianova\Novapoint\Extensions\NvdbAccess\NvdbRestApiService\NvdbRestApiService.vcxproj (/Build) 18:23:29 18:26:18 00:02:48 View
Executing external process: C:\Program Files (x86)\MSBuild\14.0\Bin\MSBuild.exe Starting Directory: S: Parameters: "vianova\Novapoint\Extensions\NvdbAccess\NvdbRestApiService\NvdbRestApiService.vcxproj" /t:Build /p:Configuration=Release /p:TargetFrameworkVersion=v4.6.1 /p:PlatformToolset=v140 /p:Platform=x64 Output from C:\Program Files (x86)\MSBuild\14.0\Bin\MSBuild.exe Microsoft (R) Build Engine version 14.0.25123.0 Copyright (C) Microsoft Corporation. All rights reserved. Build started 07.03.2019 18:23:29. Project "S:\vianova\Novapoint\Extensions\NvdbAccess\NvdbRestApiService\NvdbRestApiService.vcxproj" on node 1 (Build target(s)). InitializeBuildStatus: Creating "U:\Novapoint.NvdbAccess.NvdbRestApiService\Release\Novapoin.1B1F2092.tlog\unsuccessfulbuild" because "AlwaysCreate" was specified. GenerateTargetFrameworkMonikerAttribute: Skipping target "GenerateTargetFrameworkMonikerAttribute" because all output files are up-to-date with respect to the input files. ClCompile: All outputs are up-to-date. C:\Program Files (x86)\Microsoft Visual Studio 14.0\VC\bin\x86_amd64\CL.exe /c /I.\Source\ /I.\ /IT:\Inc\Third_Party_Products\nvdb\inc /AI"C:\Program Files (x86)\Reference Assemblies\Microsoft\Framework\.NETFramework\v4.6.1\\" /AI"C:\Program Files (x86)\Windows Kits\8.1\References\CommonConfiguration\Neutral" /AI"C:\Program Files (x86)\Reference Assemblies\Microsoft\Framework\.NETFramework\v4.6.1\Facades\\" /Zi /clr /nologo /W3 /WX- /sdl /MP /O2 /Ob2 /Oi /Ot /GL /D NDEBUG /D NVDBRESTAPISERVICE_EXPORTS /D _WINDOWS /D _USRDLL /D _WINDLL /D _MBCS /EHa /MD /GS /Gy /fp:precise /Zc:wchar_t /Zc:forScope /Zc:inline /Fo"U:\Novapoint.NvdbAccess.NvdbRestApiService\Release\\" /Fd"U:\Novapoint.NvdbAccess.NvdbRestApiService\Release\vc140.pdb" /TP /FUT:\Novapoint\\3rdParty\Quadri\log4net.dll /FU"C:\Program Files (x86)\Reference Assemblies\Microsoft\Framework\.NETFramework\v4.6.1\mscorlib.dll" /FUT:\Novapoint\\Binaries\Novapoint.Core.QuadriModel.dll /FU"C:\Program Files (x86)\Reference Assemblies\Microsoft\Framework\.NETFramework\v4.6.1\System.dll" /FU"C:\Program Files (x86)\Reference Assemblies\Microsoft\Framework\.NETFramework\v4.6.1\System.IO.Compression.FileSystem.dll" /FU"C:\Program Files (x86)\Reference Assemblies\Microsoft\Framework\.NETFramework\v4.6.1\System.Net.Http.dll" /FU"C:\Program Files (x86)\Reference Assemblies\Microsoft\Framework\.NETFramework\v4.6.1\System.Web.dll" /FU"C:\Program Files (x86)\Reference Assemblies\Microsoft\Framework\.NETFramework\v4.6.1\System.Xml.dll" /FUT:\Novapoint\\Binaries\Vianova.Core.dll /FUT:\Novapoint\\Binaries\Vianova.Core.Exceptions.dll /FUT:\Novapoint\\Binaries\Vianova.Core.Math.dll /errorReport:queue /clr:nostdlib Source\ChangeSetStatusToManaged.cpp Source\DataSetDownloader.cpp Source\NvdbRestApiService.cpp Source\Readers\NvdbJsonRoadReferenceStretchReader.cpp ChangeSetStatusToManaged.cpp DataSetDownloader.cpp NvdbRestApiService.cpp NvdbJsonRoadReferenceStretchReader.cpp C:\Program Files (x86)\Microsoft Visual Studio 14.0\VC\bin\x86_amd64\CL.exe /c /I.\Source\ /I.\ /IT:\Inc\Third_Party_Products\nvdb\inc /Zi /nologo /W3 /WX- /sdl /MP /O2 /Ob2 /Oi /Ot /GL /D NDEBUG /D NVDBRESTAPISERVICE_EXPORTS /D _WINDOWS /D _USRDLL /D _WINDLL /D _MBCS /EHa /MD /GS /Gy /fp:precise /Zc:wchar_t /Zc:forScope /Zc:inline /Fo"U:\Novapoint.NvdbAccess.NvdbRestApiService\Release\\" /Fd"U:\Novapoint.NvdbAccess.NvdbRestApiService\Release\vc140.pdb" /TP /errorReport:queue Source\Creators\QuadriDataSetCreator.cpp Source\Creators\QuadriFeatureCatalogueCreator.cpp Source\Creators\QuadriFeatureCreator.cpp Source\Creators\QuadriNetElementCreator.cpp Source\Creators\QuadriObjectCreator_Feature.cpp Source\Creators\QuadriObjectCreator_FeatureCatalogue.cpp Source\Creators\QuadriObjectCreator_Geometry.cpp Source\Creators\QuadriObjectCreator_NetElement.cpp Source\Creators\WktHandler.cpp Source\NvdbJsonToChangeSet.cpp Source\NvdbRestApiInterpreter.cpp Source\Readers\NvdbJsonChangeSetResourceReader.cpp Source\Readers\NvdbJsonChangeSetsReader.cpp Source\Readers\NvdbJsonFeatureCatalogueReader.cpp Source\Readers\NvdbJsonFeaturesReader.cpp Source\Readers\NvdbJsonLockConfictsReader.cpp Source\Readers\NvdbJsonLockReader.cpp Source\Readers\NvdbJsonLocksReader.cpp Source\Readers\NvdbJsonNodeReader.cpp Source\Readers\NvdbJsonReaders_ChangeSet.cpp Source\Readers\NvdbJsonReaders_Feature.cpp Source\Readers\NvdbJsonReaders_FeatureCatalogue.cpp Source\Readers\NvdbJsonReaders_Locks.cpp Source\Readers\NvdbJsonReaders_NetElement.cpp Source\Readers\NvdbJsonReaders_Token.cpp Source\Readers\NvdbJsonRefLinkReader.cpp Source\Readers\NvdbJsonTokenReader.cpp Source\Writer\ChangeSetWriter.cpp Source\Writer\LockWriter.cpp Source\Writer\QuadriObjectToXml_Feature.cpp Source\Writer\QuadriObjectToXml_NetElement.cpp QuadriDataSetCreator.cpp QuadriFeatureCatalogueCreator.cpp QuadriFeatureCreator.cpp QuadriNetElementCreator.cpp QuadriObjectCreator_Feature.cpp QuadriObjectCreator_FeatureCatalogue.cpp QuadriObjectCreator_Geometry.cpp QuadriObjectCreator_NetElement.cpp Source\Creators\QuadriObjectCreator_FeatureCatalogue.cpp(290): warning C4244: 'argument': conversion from 'const double' to 'long', possible loss of data [S:\vianova\Novapoint\Extensions\NvdbAccess\NvdbRestApiService\NvdbRestApiService.vcxproj] WktHandler.cpp NvdbJsonToChangeSet.cpp NvdbRestApiInterpreter.cpp NvdbJsonChangeSetResourceReader.cpp NvdbJsonChangeSetsReader.cpp NvdbJsonFeatureCatalogueReader.cpp NvdbJsonFeaturesReader.cpp NvdbJsonLockConfictsReader.cpp NvdbJsonLockReader.cpp NvdbJsonLocksReader.cpp NvdbJsonNodeReader.cpp NvdbJsonReaders_ChangeSet.cpp NvdbJsonReaders_Feature.cpp NvdbJsonReaders_FeatureCatalogue.cpp NvdbJsonReaders_Locks.cpp NvdbJsonReaders_NetElement.cpp NvdbJsonReaders_Token.cpp NvdbJsonRefLinkReader.cpp NvdbJsonTokenReader.cpp ChangeSetWriter.cpp LockWriter.cpp QuadriObjectToXml_Feature.cpp QuadriObjectToXml_NetElement.cpp All outputs are up-to-date. Link: C:\Program Files (x86)\Microsoft Visual Studio 14.0\VC\bin\x86_amd64\link.exe /ERRORREPORT:QUEUE /OUT:"T:\Novapoint\Binaries\Novapoint.NvdbAccess.NvdbRestApiService.dll" /INCREMENTAL:NO /NOLOGO /LIBPATH:T:\Lib\\Third_Party_Products\nvdb kernel32.lib user32.lib gdi32.lib winspool.lib comdlg32.lib advapi32.lib shell32.lib ole32.lib oleaut32.lib uuid.lib odbc32.lib odbccp32.lib /MANIFEST /MANIFESTUAC:"level='asInvoker' uiAccess='false'" /manifest:embed /Debug /PDB:"T:\Novapoint\Binaries\Novapoint.NvdbAccess.NvdbRestApiService.pdb" /SUBSYSTEM:WINDOWS /OPT:REF /OPT:ICF /LTCG:incremental /TLBID:1 /DYNAMICBASE /FIXED:NO /NXCOMPAT /IMPLIB:"T:\Lib\\Novapoint.NvdbAccess.NvdbRestApiService.lib" /MACHINE:X64 /DLL U:\Novapoint.NvdbAccess.NvdbRestApiService\Release\ChangeSetStatusToManaged.obj U:\Novapoint.NvdbAccess.NvdbRestApiService\Release\QuadriDataSetCreator.obj U:\Novapoint.NvdbAccess.NvdbRestApiService\Release\QuadriFeatureCatalogueCreator.obj U:\Novapoint.NvdbAccess.NvdbRestApiService\Release\QuadriFeatureCreator.obj U:\Novapoint.NvdbAccess.NvdbRestApiService\Release\QuadriNetElementCreator.obj U:\Novapoint.NvdbAccess.NvdbRestApiService\Release\QuadriObjectCreator_Feature.obj U:\Novapoint.NvdbAccess.NvdbRestApiService\Release\QuadriObjectCreator_FeatureCatalogue.obj U:\Novapoint.NvdbAccess.NvdbRestApiService\Release\QuadriObjectCreator_Geometry.obj U:\Novapoint.NvdbAccess.NvdbRestApiService\Release\QuadriObjectCreator_NetElement.obj U:\Novapoint.NvdbAccess.NvdbRestApiService\Release\QuadriObjectsIndex.obj U:\Novapoint.NvdbAccess.NvdbRestApiService\Release\WktHandler.obj U:\Novapoint.NvdbAccess.NvdbRestApiService\Release\DataSetDownloader.obj U:\Novapoint.NvdbAccess.NvdbRestApiService\Release\DataSetManipulator.obj U:\Novapoint.NvdbAccess.NvdbRestApiService\Release\dllmain.obj U:\Novapoint.NvdbAccess.NvdbRestApiService\Release\JsonToXml.obj U:\Novapoint.NvdbAccess.NvdbRestApiService\Release\NvdbJsonDataFiles.obj U:\Novapoint.NvdbAccess.NvdbRestApiService\Release\NvdbJsonToChangeSet.obj U:\Novapoint.NvdbAccess.NvdbRestApiService\Release\NvdbRestApiCredentials.obj U:\Novapoint.NvdbAccess.NvdbRestApiService\Release\NvdbRestApiInterpreter.obj U:\Novapoint.NvdbAccess.NvdbRestApiService\Release\NvdbRestApiRequestHandler.obj U:\Novapoint.NvdbAccess.NvdbRestApiService\Release\NvdbRestApiService.obj U:\Novapoint.NvdbAccess.NvdbRestApiService\Release\NvdbRestApiServiceSettings.obj U:\Novapoint.NvdbAccess.NvdbRestApiService\Release\NvdbJsonChangeSetResourceReader.obj U:\Novapoint.NvdbAccess.NvdbRestApiService\Release\NvdbJsonChangeSetsReader.obj U:\Novapoint.NvdbAccess.NvdbRestApiService\Release\NvdbJsonFeaturesReader.obj U:\Novapoint.NvdbAccess.NvdbRestApiService\Release\NvdbJsonLockConfictsReader.obj U:\Novapoint.NvdbAccess.NvdbRestApiService\Release\NvdbJsonFeatureCatalogueReader.obj U:\Novapoint.NvdbAccess.NvdbRestApiService\Release\NvdbJsonLockReader.obj U:\Novapoint.NvdbAccess.NvdbRestApiService\Release\NvdbJsonLocksReader.obj U:\Novapoint.NvdbAccess.NvdbRestApiService\Release\NvdbJsonNodeReader.obj U:\Novapoint.NvdbAccess.NvdbRestApiService\Release\NvdbJsonReaders_ChangeSet.obj U:\Novapoint.NvdbAccess.NvdbRestApiService\Release\NvdbJsonReaders_Feature.obj U:\Novapoint.NvdbAccess.NvdbRestApiService\Release\NvdbJsonReaders_FeatureCatalogue.obj U:\Novapoint.NvdbAccess.NvdbRestApiService\Release\NvdbJsonReaders_Locks.obj U:\Novapoint.NvdbAccess.NvdbRestApiService\Release\NvdbJsonReaders_NetElement.obj U:\Novapoint.NvdbAccess.NvdbRestApiService\Release\NvdbJsonReaders_Token.obj U:\Novapoint.NvdbAccess.NvdbRestApiService\Release\NvdbJsonRefLinkReader.obj U:\Novapoint.NvdbAccess.NvdbRestApiService\Release\NvdbJsonRoadReferenceStretchReader.obj U:\Novapoint.NvdbAccess.NvdbRestApiService\Release\NvdbJsonTokenReader.obj U:\Novapoint.NvdbAccess.NvdbRestApiService\Release\ReaderBase.obj U:\Novapoint.NvdbAccess.NvdbRestApiService\Release\stdafx.obj U:\Novapoint.NvdbAccess.NvdbRestApiService\Release\AttributeStatusHandler.obj U:\Novapoint.NvdbAccess.NvdbRestApiService\Release\ChangeSetWriter.obj U:\Novapoint.NvdbAccess.NvdbRestApiService\Release\FeatureVersionStatusHandler.obj U:\Novapoint.NvdbAccess.NvdbRestApiService\Release\LockWriter.obj U:\Novapoint.NvdbAccess.NvdbRestApiService\Release\PortStatusHandler.obj U:\Novapoint.NvdbAccess.NvdbRestApiService\Release\QuadriObjectToXml_Feature.obj U:\Novapoint.NvdbAccess.NvdbRestApiService\Release\QuadriObjectToXml_NetElement.obj U:\Novapoint.NvdbAccess.NvdbRestApiService\Release\XmlWriter.obj "U:\Novapoint.NvdbAccess.NvdbRestApiService\Release\.NETFramework,Version=v4.6.1.AssemblyAttributes.obj" Creating library T:\Lib\\Novapoint.NvdbAccess.NvdbRestApiService.lib and object T:\Lib\\Novapoint.NvdbAccess.NvdbRestApiService.exp Generating code 816 of 15842 functions ( 5.2%) were compiled, the rest were copied from previous compilation. 186 functions were new in current compilation 303 functions had inline decision re-evaluated but remain unchanged Finished generating code NvdbJsonDataFiles.obj : error LNK2022: metadata operation failed (80131187) : Inconsistent method declarations in duplicated types (types: Vianova.Novapoint.Extension.NvdbAccess.NvdbJsonDataFiles; methods: RestoreModelFromZipFile): (0x06000002). [S:\vianova\Novapoint\Extensions\NvdbAccess\NvdbRestApiService\NvdbRestApiService.vcxproj] NvdbJsonDataFiles.obj : error LNK2022: metadata operation failed (80131187) : Inconsistent method declarations in duplicated types (types: Vianova.Novapoint.Extension.NvdbAccess.NvdbJsonDataFiles; methods: GetFolder): (0x06000004). [S:\vianova\Novapoint\Extensions\NvdbAccess\NvdbRestApiService\NvdbRestApiService.vcxproj] LINK : fatal error LNK1255: link failed because of metadata errors [S:\vianova\Novapoint\Extensions\NvdbAccess\NvdbRestApiService\NvdbRestApiService.vcxproj] Done Building Project "S:\vianova\Novapoint\Extensions\NvdbAccess\NvdbRestApiService\NvdbRestApiService.vcxproj" (Build target(s)) -- FAILED. Build FAILED. "S:\vianova\Novapoint\Extensions\NvdbAccess\NvdbRestApiService\NvdbRestApiService.vcxproj" (Build target) (1) -> (ClCompile target) -> Source\Creators\QuadriObjectCreator_FeatureCatalogue.cpp(290): warning C4244: 'argument': conversion from 'const double' to 'long', possible loss of data [S:\vianova\Novapoint\Extensions\NvdbAccess\NvdbRestApiService\NvdbRestApiService.vcxproj] "S:\vianova\Novapoint\Extensions\NvdbAccess\NvdbRestApiService\NvdbRestApiService.vcxproj" (Build target) (1) -> (Link target) -> NvdbJsonDataFiles.obj : error LNK2022: metadata operation failed (80131187) : Inconsistent method declarations in duplicated types (types: Vianova.Novapoint.Extension.NvdbAccess.NvdbJsonDataFiles; methods: RestoreModelFromZipFile): (0x06000002). [S:\vianova\Novapoint\Extensions\NvdbAccess\NvdbRestApiService\NvdbRestApiService.vcxproj] NvdbJsonDataFiles.obj : error LNK2022: metadata operation failed (80131187) : Inconsistent method declarations in duplicated types (types: Vianova.Novapoint.Extension.NvdbAccess.NvdbJsonDataFiles; methods: GetFolder): (0x06000004). [S:\vianova\Novapoint\Extensions\NvdbAccess\NvdbRestApiService\NvdbRestApiService.vcxproj] LINK : fatal error LNK1255: link failed because of metadata errors [S:\vianova\Novapoint\Extensions\NvdbAccess\NvdbRestApiService\NvdbRestApiService.vcxproj] 1 Warning(s) 3 Error(s) Time Elapsed 00:02:47.76 Program returned code : 1
Error Run DOS Command / Batch File CPPUnit [ e:\SVN\DCM-DIST\branches\NP21.00_STABLE\Novapoint\Binaries\Vianova.Core.Math.Tin.HalfEdge.Tests.Console.exe ] 18:52:01 18:52:16 00:00:15 View
Executing external process: C:\Windows\system32\cmd.exe Starting Directory: e:\SVN\DCM-DIST\branches\NP21.00_STABLE\Novapoint\Binaries Parameters: /c e:\SVN\DCM-DIST\branches\NP21.00_STABLE\Novapoint\Binaries\Vianova.Core.Math.Tin.HalfEdge.Tests.Console.exe Output from C:\Windows\system32\cmd.exe .......................................................................F.F.F.F.F.............................................................................................................................................................................................................................................................................................................................................................................................................................................................................. !!!FAILURES!!! Test Results: Run: 537 Failures: 5 Errors: 0 1) test: MathTinHalfEdgeCppUnitTests::TestMeshesIntersection::TestComparisonTouchingBaseAsLine (F) line: 130 ..\Vianova.Core.Math.Tin.HalfEdge.CppUnitTest\Source\TestMeshesIntersection.cpp assertion failed - Expression: regions.size() == 1 - Wrong Number of Regions 2) test: MathTinHalfEdgeCppUnitTests::TestMeshesIntersection::TestComparisonPiercingBaseAsLine (F) line: 225 ..\Vianova.Core.Math.Tin.HalfEdge.CppUnitTest\Source\TestMeshesIntersection.cpp assertion failed - Expression: regions.size() == 2 - Wrong Number of Regions 3) test: MathTinHalfEdgeCppUnitTests::TestMeshesIntersection::TestComparisonTouchingBaseAsPolygon (F) line: 335 ..\Vianova.Core.Math.Tin.HalfEdge.CppUnitTest\Source\TestMeshesIntersection.cpp assertion failed - Expression: regions.size() == 1 - Wrong Number of Regions 4) test: MathTinHalfEdgeCppUnitTests::TestMeshesIntersection::TestComparisonPiercingBaseAsPolygon (F) line: 445 ..\Vianova.Core.Math.Tin.HalfEdge.CppUnitTest\Source\TestMeshesIntersection.cpp assertion failed - Expression: regions.size() == 2 - Wrong Number of Regions 5) test: MathTinHalfEdgeCppUnitTests::TestMeshesIntersection::TestComparisonTouchingAndPiercingBase (F) line: 605 ..\Vianova.Core.Math.Tin.HalfEdge.CppUnitTest\Source\TestMeshesIntersection.cpp assertion failed - Expression: regions.size() == 3 - Wrong Number of Regions Program returned code : 5